{"text_format":"1","workbook":"xlsx","n_sheets":9,"sheets":["_xltb_storage_","1","2","3","4","5","6","7","8"],"not_rendered":{"charts":1,"images":0,"macros":1,"external_links":0,"defined_names":67,"comments":0,"pivot_tables":3},"unopened":[],"bounds":{"document_bytes":16777216,"sheet_cells":100000,"rows_first":2000,"rows_last":500,"rows_between":2000,"halvings":0,"cell_chars":16384,"cell_head_chars":4096},"cells_cut":0,"cells_raw":0,"read":"whole","date_system":"1900"}

{"sheet":"_xltb_storage_","index":0,"n_rows":2,"n_cols":3,"rows_kept":2,"cut":false,"hidden":true,"merged":[]}
["XL Toolbox Settings"]
[null,"export_path","C:\\Users\\Thomas Oscar\\Documents\\My Documents\\2020\\2020r\\2020Z\\JFPP -02-21-0420 v2 r1 Fig 4.png"]

{"sheet":"1","index":1,"n_rows":140,"n_cols":37,"rows_kept":140,"cut":false,"hidden":false,"merged":[[3,1,3,4],[6,1,6,4],[0,4,2,4],[0,0,2,3],[5,1,5,4],[7,1,7,4],[8,1,8,4],[9,1,9,4],[10,0,15,4],[4,1,4,4]]}
["Validation Tool for Predictive Microbiology (Version 1.0)",null,null,null,"ValT"]
[]
[]
["Spreadsheet","Description"]
[2,"Dependent Data Input"]
[3,"Decision Tree for Dependent Data"]
[4,"Independent Data for Interpolation"]
[5,"Decision Tree for Interpolation"]
[6,"Independent Data for Extrapolation"]
[7,"Decision Tree for Extrapolation"]
["Welcome to ValT (vault) a spreadsheet tool for validation of models that predict the growth (log number) of human bacterial pathogens in food as a function of two independent variables.  ValT was developed by the U. S. Department of Agriculture, Agricultural Research Service.  It is based on the test data and model performance criteria of the acceptable prediction zones (APZ) method.     "]
[]
[]
[]
[]
[]
[]
[]
[]
[]
{"$rows_left_out":121}
{"sheet":"2","index":2,"n_rows":401,"n_cols":6,"rows_kept":401,"cut":false,"hidden":false,"merged":[]}
["Temp","Time","Observed","Predicted","Residual","APZ"]
[16,0,1.01,0.83852684997566618,{"$f":"IF(C2=\"\",\"\",IF(C2*D2<0,-2.5,C2-D2))","v":0.17147315002433383},{"$f":"IF(E2=\"\",\"\",IF(E2<-2,0,IF(E2>1,0,VLOOKUP(E2,'8'!$A$2:$B$1503,2,TRUE))))","v":1}]
[16,0,1.01,0.83852684997566618,{"$f":"IF(C3=\"\",\"\",IF(C3*D3<0,-2.5,C3-D3))","v":0.17147315002433383},{"$f":"IF(E3=\"\",\"\",IF(E3<-2,0,IF(E3>1,0,VLOOKUP(E3,'8'!$A$2:$B$1503,2,TRUE))))","v":1}]
[16,0,1.01,0.83852684997566618,0.17147315002433383,{"$f":"IF(E4=\"\",\"\",IF(E4<-2,0,IF(E4>1,0,VLOOKUP(E4,'8'!$A$2:$B$1503,2,TRUE))))","v":1}]
[16,0,1.1599999999999999,0.83852684997566618,{"$f":"IF(C5=\"\",\"\",IF(C5*D5<0,-2.5,C5-D5))","v":0.32147315002433374},{"$f":"IF(E5=\"\",\"\",IF(E5<-2,0,IF(E5>1,0,VLOOKUP(E5,'8'!$A$2:$B$1503,2,TRUE))))","v":1}]
[16,2,0.9,0.8448060930379746,5.5193906962025419E-2,{"$f":"IF(E6=\"\",\"\",IF(E6<-2,0,IF(E6>1,0,VLOOKUP(E6,'8'!$A$2:$B$1503,2,TRUE))))","v":1}]
[16,2,1.01,0.8448060930379746,0.16519390696202541,{"$f":"IF(E7=\"\",\"\",IF(E7<-2,0,IF(E7>1,0,VLOOKUP(E7,'8'!$A$2:$B$1503,2,TRUE))))","v":1}]
[16,2,1.01,0.8448060930379746,0.16519390696202541,{"$f":"IF(E8=\"\",\"\",IF(E8<-2,0,IF(E8>1,0,VLOOKUP(E8,'8'!$A$2:$B$1503,2,TRUE))))","v":1}]
[16,2,1.01,0.8448060930379746,0.16519390696202541,{"$f":"IF(E9=\"\",\"\",IF(E9<-2,0,IF(E9>1,0,VLOOKUP(E9,'8'!$A$2:$B$1503,2,TRUE))))","v":1}]
[16,4,0.72,0.86350225699034633,-0.14350225699034636,{"$f":"IF(E10=\"\",\"\",IF(E10<-2,0,IF(E10>1,0,VLOOKUP(E10,'8'!$A$2:$B$1503,2,TRUE))))","v":1}]
[16,4,0.72,0.86350225699034633,{"$f":"IF(C11=\"\",\"\",IF(C11*D11<0,-2.5,C11-D11))","v":-0.14350225699034636},{"$f":"IF(E11=\"\",\"\",IF(E11<-2,0,IF(E11>1,0,VLOOKUP(E11,'8'!$A$2:$B$1503,2,TRUE))))","v":1}]
[16,4,0.72,0.86350225699034633,-0.14350225699034636,{"$f":"IF(E12=\"\",\"\",IF(E12<-2,0,IF(E12>1,0,VLOOKUP(E12,'8'!$A$2:$B$1503,2,TRUE))))","v":1}]
[16,4,1.1599999999999999,0.86350225699034633,0.29649774300965359,{"$f":"IF(E13=\"\",\"\",IF(E13<-2,0,IF(E13>1,0,VLOOKUP(E13,'8'!$A$2:$B$1503,2,TRUE))))","v":1}]
[16,6,0.72,0.90585147661757226,-0.18585147661757229,{"$f":"IF(E14=\"\",\"\",IF(E14<-2,0,IF(E14>1,0,VLOOKUP(E14,'8'!$A$2:$B$1503,2,TRUE))))","v":1}]
[16,6,1.01,0.90585147661757226,0.10414852338242775,{"$f":"IF(E15=\"\",\"\",IF(E15<-2,0,IF(E15>1,0,VLOOKUP(E15,'8'!$A$2:$B$1503,2,TRUE))))","v":1}]
[16,6,1.01,0.90585147661757226,0.10414852338242775,{"$f":"IF(E16=\"\",\"\",IF(E16<-2,0,IF(E16>1,0,VLOOKUP(E16,'8'!$A$2:$B$1503,2,TRUE))))","v":1}]
[16,6,1.01,0.90585147661757226,0.10414852338242775,{"$f":"IF(E17=\"\",\"\",IF(E17<-2,0,IF(E17>1,0,VLOOKUP(E17,'8'!$A$2:$B$1503,2,TRUE))))","v":1}]
[16,8,0.72,0.99399524833986708,-0.2739952483398671,{"$f":"IF(E18=\"\",\"\",IF(E18<-2,0,IF(E18>1,0,VLOOKUP(E18,'8'!$A$2:$B$1503,2,TRUE))))","v":1}]
[16,8,1.01,0.99399524833986708,1.6004751660132932E-2,{"$f":"IF(E19=\"\",\"\",IF(E19<-2,0,IF(E19>1,0,VLOOKUP(E19,'8'!$A$2:$B$1503,2,TRUE))))","v":1}]
[16,8,1.1599999999999999,0.99399524833986708,0.16600475166013284,{"$f":"IF(E20=\"\",\"\",IF(E20<-2,0,IF(E20>1,0,VLOOKUP(E20,'8'!$A$2:$B$1503,2,TRUE))))","v":1}]
{"$rows_left_out":382}
{"sheet":"3","index":3,"n_rows":30,"n_cols":24,"rows_kept":30,"cut":false,"hidden":false,"merged":[[0,2,0,14],[1,2,1,14],[2,2,2,14],[3,2,3,14],[6,2,6,14],[4,2,4,14],[5,2,5,14],[5,19,5,24],[6,19,6,24],[7,19,7,24],[8,19,8,24],[8,2,8,14],[7,2,7,14],[0,19,0,24],[1,19,1,24],[2,19,2,24],[3,19,3,24],[4,19,4,24]]}
["Q","A","Decision Tree for Dependent Data",null,null,null,null,null,null,null,null,null,null,null,null,null,null,"Q","A","Decision Tree for Dependent Data"]
[1,"yes","Were the data used to develop the model?",null,null,null,null,null,null,null,null,null,null,null,null,null,null,1,"yes","Were the data used to develop the model?"]
[2,"yes","Were the independent variables evenly spaced?",null,null,null,null,null,null,null,null,null,null,null,null,null,null,2,"yes","Were the independent variables evenly spaced?"]
[3,"yes","Was there a minimum of four prediction cases per combination of independent variables?",null,null,null,null,null,null,null,null,null,null,null,null,null,null,3,"yes","Was there a minimum of four prediction cases per combination of independent variables?"]
[4,"yes","Did all combinations of independent variables have the same number of prediction cases?",null,null,null,null,null,null,null,null,null,null,null,null,null,null,4,"yes","Did all combinations of independent variables have the same number of prediction cases?"]
[5,"yes","Was the overall pAPZ ≥ 0.70?",null,null,null,null,null,null,null,null,null,null,null,null,null,null,5,"yes","Was the overall pAPZ ≥ 0.70?"]
[6,"yes","Was pAPZ for all individual levels of independent variables ≥ 0.70?",null,null,null,null,null,null,null,null,null,null,null,null,null,null,6,"yes","Was pAPZ for all individual levels of independent variables ≥ 0.70?"]
[7,"yes","Was a single pAPZ ≥ 0.70 for every three consecutive combinations of the independent variables?",null,null,null,null,null,null,null,null,null,null,null,null,null,null,7,"yes","Was a single pAPZ ≥ 0.70 for every three consecutive combinations of the independent variables?"]
[8,{"$f":"IF(CONCATENATE(B2,B3,B4,B5,B6,B7,B8)=\"yesyesyesyesyesyesyes\",\"yes\",\"no\")","v":"yes"},"Was the model validated for dependent data?",null,null,null,null,null,null,null,null,null,null,null,null,null,null,8,"yes","Was the model validated for dependent data?"]
["Average of APZ","Time",null,null,null,null,null,null,null,null,null,null,null,null,null,null,null,"pAPZ","Time"]
["Temp",0,2,4,6,8,"Average",null,null,null,null,null,null,null,null,null,null,"Temp",0,2,4,6,8,"Average"]
[16,1,1,1,1,1,1,null,null,null,null,null,null,null,null,null,null,16,1,1,1,1,1,1]
[20,1,1,1,1,1,1,null,null,null,null,null,null,null,null,null,null,20,1,1,1,1,1,1]
[24,1,1,1,1,1,1,null,null,null,null,null,null,null,null,null,null,24,1,1,1,1,1,1]
[28,1,0.92600000000000016,0.98150000000000026,1,0.96750000000000025,0.9750000000000002,null,null,null,null,null,null,null,null,null,null,28,1,0.92600000000000016,0.98150000000000026,1,0.96750000000000025,0.9750000000000002]
[32,1,1,1,0.84800000000000031,1,0.96960000000000013,null,null,null,null,null,null,null,null,null,null,32,1,1,1,0.84800000000000031,1,0.96960000000000013]
[36,0.9700000000000002,0.99650000000000016,1,0.82700000000000007,1,0.9587,null,null,null,null,null,null,null,null,null,null,36,0.9700000000000002,0.99650000000000016,1,0.82700000000000007,1,0.9587]
[40,1,0.74149999999999994,0.93800000000000017,1,0.8570000000000001,0.9073,null,null,null,null,null,null,null,null,null,null,40,1,0.74149999999999994,0.93800000000000017,1,0.8570000000000001,0.9073]
["Average",0.99571428571428577,0.95200000000000007,0.98850000000000016,0.95357142857142863,0.97492857142857148,0.97294285714285711,null,null,null,null,null,null,null,null,null,null,"Average",0.99571428571428577,0.95200000000000007,0.98850000000000016,0.95357142857142863,0.97492857142857148,0.97294285714285711]
[]
{"$rows_left_out":11}
{"sheet":"4","index":4,"n_rows":401,"n_cols":6,"rows_kept":401,"cut":false,"hidden":false,"merged":[]}
["Temp","Time","Observed","Predicted","Residual","APZ"]
[18,1,0.52,0.84,{"$f":"IF(C2=\"\",\"\",IF(C2*D2<0,-2.5,C2-D2))","v":-0.31999999999999995},{"$f":"IF(E2=\"\",\"\",IF(E2<-2,0,IF(E2>1,0,VLOOKUP(E2,'8'!$A$2:$B$1503,2,TRUE))))","v":1}]
[18,1,1.02,0.84075658101256812,{"$f":"IF(C3=\"\",\"\",IF(C3*D3<0,-2.5,C3-D3))","v":0.1792434189874319},{"$f":"IF(E3=\"\",\"\",IF(E3<-2,0,IF(E3>1,0,VLOOKUP(E3,'8'!$A$2:$B$1503,2,TRUE))))","v":1}]
[18,1,1.17,0.84075658101256812,0.32924341898743181,{"$f":"IF(E4=\"\",\"\",IF(E4<-2,0,IF(E4>1,0,VLOOKUP(E4,'8'!$A$2:$B$1503,2,TRUE))))","v":1}]
[18,3,0.74,0.85422263435461643,-0.11422263435461644,{"$f":"IF(E5=\"\",\"\",IF(E5<-2,0,IF(E5>1,0,VLOOKUP(E5,'8'!$A$2:$B$1503,2,TRUE))))","v":1}]
[18,3,1.17,0.85422263435461643,0.3157773656453835,{"$f":"IF(E6=\"\",\"\",IF(E6<-2,0,IF(E6>1,0,VLOOKUP(E6,'8'!$A$2:$B$1503,2,TRUE))))","v":1}]
[18,3,1.3,0.85422263435461643,0.44577736564538362,{"$f":"IF(E7=\"\",\"\",IF(E7<-2,0,IF(E7>1,0,VLOOKUP(E7,'8'!$A$2:$B$1503,2,TRUE))))","v":1}]
[18,5,0.18,0.89644828986988156,-0.71644828986988163,{"$f":"IF(E8=\"\",\"\",IF(E8<-2,0,IF(E8>1,0,VLOOKUP(E8,'8'!$A$2:$B$1503,2,TRUE))))","v":1}]
[18,5,0.74,0.89644828986988156,-0.15644828986988157,{"$f":"IF(E9=\"\",\"\",IF(E9<-2,0,IF(E9>1,0,VLOOKUP(E9,'8'!$A$2:$B$1503,2,TRUE))))","v":1}]
[18,5,0.74,0.89644828986988156,-0.15644828986988157,{"$f":"IF(E10=\"\",\"\",IF(E10<-2,0,IF(E10>1,0,VLOOKUP(E10,'8'!$A$2:$B$1503,2,TRUE))))","v":1}]
[18,7,1.02,1.0257476355392199,-5.7476355392198641E-3,{"$f":"IF(E11=\"\",\"\",IF(E11<-2,0,IF(E11>1,0,VLOOKUP(E11,'8'!$A$2:$B$1503,2,TRUE))))","v":1}]
[18,7,1.33,1.0257476355392199,0.30425236446078019,{"$f":"IF(E12=\"\",\"\",IF(E12<-2,0,IF(E12>1,0,VLOOKUP(E12,'8'!$A$2:$B$1503,2,TRUE))))","v":1}]
[18,7,1.53,1.0257476355392199,0.50425236446078014,{"$f":"IF(E13=\"\",\"\",IF(E13<-2,0,IF(E13>1,0,VLOOKUP(E13,'8'!$A$2:$B$1503,2,TRUE))))","v":0.99200000000000088}]
[22,1,0.74,0.84218106553215555,-0.10218106553215556,{"$f":"IF(E14=\"\",\"\",IF(E14<-2,0,IF(E14>1,0,VLOOKUP(E14,'8'!$A$2:$B$1503,2,TRUE))))","v":1}]
[22,1,0.92,0.84218106553215555,7.7818934467844492E-2,{"$f":"IF(E15=\"\",\"\",IF(E15<-2,0,IF(E15>1,0,VLOOKUP(E15,'8'!$A$2:$B$1503,2,TRUE))))","v":1}]
[22,1,1.27,0.84218106553215555,0.42781893446784447,{"$f":"IF(E16=\"\",\"\",IF(E16<-2,0,IF(E16>1,0,VLOOKUP(E16,'8'!$A$2:$B$1503,2,TRUE))))","v":1}]
[22,3,0.92,0.86747847518073917,5.2521524819260867E-2,{"$f":"IF(E17=\"\",\"\",IF(E17<-2,0,IF(E17>1,0,VLOOKUP(E17,'8'!$A$2:$B$1503,2,TRUE))))","v":1}]
[22,3,1.0900000000000001,0.86747847518073917,0.22252152481926091,{"$f":"IF(E18=\"\",\"\",IF(E18<-2,0,IF(E18>1,0,VLOOKUP(E18,'8'!$A$2:$B$1503,2,TRUE))))","v":1}]
[22,3,1.27,0.86747847518073917,0.40252152481926085,{"$f":"IF(E19=\"\",\"\",IF(E19<-2,0,IF(E19>1,0,VLOOKUP(E19,'8'!$A$2:$B$1503,2,TRUE))))","v":1}]
[22,5,0.52,1.0426578563875712,-0.52265785638757123,{"$f":"IF(E20=\"\",\"\",IF(E20<-2,0,IF(E20>1,0,VLOOKUP(E20,'8'!$A$2:$B$1503,2,TRUE))))","v":1}]
{"$rows_left_out":382}
{"sheet":"5","index":5,"n_rows":33,"n_cols":22,"rows_kept":33,"cut":false,"hidden":false,"merged":[[9,2,9,14],[10,2,10,14],[0,2,0,14],[2,2,2,14],[3,2,3,14],[1,2,1,14],[4,2,4,14],[5,2,5,14],[6,2,6,14],[7,2,7,14],[8,2,8,14],[0,18,0,26],[1,18,1,26],[2,18,2,26],[3,18,3,26],[4,18,4,25],[10,18,10,26],[5,18,5,26],[6,18,6,26],[7,18,7,26],[8,18,8,26],[9,18,9,26]]}
["Q","A","Decision Tree for Interpolation",null,null,null,null,null,null,null,null,null,null,null,null,null,"Q","A","Decision Tree for Interpolation"]
[1,{"$f":"'3'!B9","v":"yes"},"Was the model validated for dependent data?",null,null,null,null,null,null,null,null,null,null,null,null,null,1,"yes","Was the model validated for dependent data?"]
[2,"yes","Were the data independent?",null,null,null,null,null,null,null,null,null,null,null,null,null,2,"yes","Were the data independent?"]
[3,"yes","Were the data collected using the same methods as dependent data?",null,null,null,null,null,null,null,null,null,null,null,null,null,3,"yes","Were the data collected using the same methods as dependent data?"]
[4,"yes","Were the independent variables at values intermediate to those used in model development?",null,null,null,null,null,null,null,null,null,null,null,null,null,4,"yes","Were the independent variables at values intermediate to those used in model development?"]
[5,"yes","Was there a minimum of two prediction cases per combination of independent variables?",null,null,null,null,null,null,null,null,null,null,null,null,null,5,"yes","Was there a minimum of two prediction cases per combination of independent variables?"]
[6,"yes","Did all combinations of independent variables have the same number of prediction cases?",null,null,null,null,null,null,null,null,null,null,null,null,null,6,"yes","Did all combinations of independent variables have the same number of prediction cases?"]
[7,"yes","Was the overall pAPZ ≥ 0.70?",null,null,null,null,null,null,null,null,null,null,null,null,null,7,"yes","Was the overall pAPZ ≥ 0.70?"]
[8,"yes","Was pAPZ for all individual levels of independent variables ≥ 0.70?",null,null,null,null,null,null,null,null,null,null,null,null,null,8,"yes","Was pAPZ for all individual levels of independent variables ≥ 0.70?"]
[9,"yes","Was a single pAPZ ≥ 0.70 for every three consecutive combinations of the independent variables?",null,null,null,null,null,null,null,null,null,null,null,null,null,9,"yes","Was a single pAPZ ≥ 0.70 for every three consecutive combinations of the independent variables?"]
[10,{"$f":"IF(CONCATENATE(B2,B3,B4,B5,B6,B7,B8,B10)=\"yesyesyesyesyesyesyesyes\",\"yes\",\"no\")","v":"yes"},"Was the model validated for interpolation?",null,null,null,null,null,null,null,null,null,null,null,null,null,10,"yes","Was the model validated for interpolation?"]
["Average of APZ","Time",null,null,null,null,null,null,null,null,null,null,null,null,null,null,"pAPZ","Time"]
["Temp",1,3,5,7,"Average",null,null,null,null,null,null,null,null,null,null,"Temp",1,3,5,7,"Average"]
[18,1,1,1,0.99733333333333363,0.99933333333333341,null,null,null,null,null,null,null,null,null,null,18,1,1,1,0.99733333333333363,0.99933333333333341]
[22,1,1,0.94200000000000017,1,0.98550000000000004,null,null,null,null,null,null,null,null,null,null,22,1,1,0.94200000000000017,1,0.98550000000000004]
[26,1,1,0.92133333333333356,0.99800000000000022,0.97983333333333356,null,null,null,null,null,null,null,null,null,null,26,1,1,0.92133333333333356,0.99800000000000022,0.97983333333333356]
[30,1,1,1,0.90666666666666684,0.97666666666666668,null,null,null,null,null,null,null,null,null,null,30,1,1,1,0.90666666666666684,0.97666666666666668]
[34,1,0.77000000000000013,0.84333333333333338,0.69366666666666676,0.8267500000000001,null,null,null,null,null,null,null,null,null,null,34,1,0.77000000000000013,0.84333333333333338,0.69366666666666676,0.8267500000000001]
[38,1,0.67400000000000004,0.66666666666666663,1,0.83516666666666672,null,null,null,null,null,null,null,null,null,null,38,1,0.67400000000000004,0.66666666666666663,1,0.83516666666666672]
["Average",1,0.90733333333333333,0.89555555555555577,0.9326111111111115,0.93387500000000001,null,null,null,null,null,null,null,null,null,null,"Average",1,0.90733333333333333,0.89555555555555577,0.9326111111111115,0.93387500000000001]
{"$rows_left_out":14}
{"sheet":"6","index":6,"n_rows":401,"n_cols":6,"rows_kept":401,"cut":false,"hidden":false,"merged":[]}
["Temp","Time","Observed","Predicted","Residual","APZ"]
[null,null,null,null,{"$f":"IF(C2=\"\",\"\",IF(C2*D2<0,-2.5,C2-D2))","v":""},{"$f":"IF(E2=\"\",\"\",IF(E2<-2,0,IF(E2>1,0,VLOOKUP(E2,'8'!$A$2:$B$1503,2,TRUE))))","v":""}]
[null,null,null,null,{"$f":"IF(C3=\"\",\"\",IF(C3*D3<0,-2.5,C3-D3))","v":""},{"$f":"IF(E3=\"\",\"\",IF(E3<-2,0,IF(E3>1,0,VLOOKUP(E3,'8'!$A$2:$B$1503,2,TRUE))))","v":""}]
[null,null,null,null,"",{"$f":"IF(E4=\"\",\"\",IF(E4<-2,0,IF(E4>1,0,VLOOKUP(E4,'8'!$A$2:$B$1503,2,TRUE))))","v":""}]
[null,null,null,null,"",{"$f":"IF(E5=\"\",\"\",IF(E5<-2,0,IF(E5>1,0,VLOOKUP(E5,'8'!$A$2:$B$1503,2,TRUE))))","v":""}]
[null,null,null,null,"",{"$f":"IF(E6=\"\",\"\",IF(E6<-2,0,IF(E6>1,0,VLOOKUP(E6,'8'!$A$2:$B$1503,2,TRUE))))","v":""}]
[null,null,null,null,"",{"$f":"IF(E7=\"\",\"\",IF(E7<-2,0,IF(E7>1,0,VLOOKUP(E7,'8'!$A$2:$B$1503,2,TRUE))))","v":""}]
[null,null,null,null,"",{"$f":"IF(E8=\"\",\"\",IF(E8<-2,0,IF(E8>1,0,VLOOKUP(E8,'8'!$A$2:$B$1503,2,TRUE))))","v":""}]
[null,null,null,null,"",{"$f":"IF(E9=\"\",\"\",IF(E9<-2,0,IF(E9>1,0,VLOOKUP(E9,'8'!$A$2:$B$1503,2,TRUE))))","v":""}]
[null,null,null,null,"",{"$f":"IF(E10=\"\",\"\",IF(E10<-2,0,IF(E10>1,0,VLOOKUP(E10,'8'!$A$2:$B$1503,2,TRUE))))","v":""}]
[null,null,null,null,"",{"$f":"IF(E11=\"\",\"\",IF(E11<-2,0,IF(E11>1,0,VLOOKUP(E11,'8'!$A$2:$B$1503,2,TRUE))))","v":""}]
[null,null,null,null,"",{"$f":"IF(E12=\"\",\"\",IF(E12<-2,0,IF(E12>1,0,VLOOKUP(E12,'8'!$A$2:$B$1503,2,TRUE))))","v":""}]
[null,null,null,null,"",{"$f":"IF(E13=\"\",\"\",IF(E13<-2,0,IF(E13>1,0,VLOOKUP(E13,'8'!$A$2:$B$1503,2,TRUE))))","v":""}]
[null,null,null,null,"",{"$f":"IF(E14=\"\",\"\",IF(E14<-2,0,IF(E14>1,0,VLOOKUP(E14,'8'!$A$2:$B$1503,2,TRUE))))","v":""}]
[null,null,null,null,"",{"$f":"IF(E15=\"\",\"\",IF(E15<-2,0,IF(E15>1,0,VLOOKUP(E15,'8'!$A$2:$B$1503,2,TRUE))))","v":""}]
[null,null,null,null,"",{"$f":"IF(E16=\"\",\"\",IF(E16<-2,0,IF(E16>1,0,VLOOKUP(E16,'8'!$A$2:$B$1503,2,TRUE))))","v":""}]
[null,null,null,null,"",{"$f":"IF(E17=\"\",\"\",IF(E17<-2,0,IF(E17>1,0,VLOOKUP(E17,'8'!$A$2:$B$1503,2,TRUE))))","v":""}]
[null,null,null,null,"",{"$f":"IF(E18=\"\",\"\",IF(E18<-2,0,IF(E18>1,0,VLOOKUP(E18,'8'!$A$2:$B$1503,2,TRUE))))","v":""}]
[null,null,null,null,"",{"$f":"IF(E19=\"\",\"\",IF(E19<-2,0,IF(E19>1,0,VLOOKUP(E19,'8'!$A$2:$B$1503,2,TRUE))))","v":""}]
[null,null,null,null,"",{"$f":"IF(E20=\"\",\"\",IF(E20<-2,0,IF(E20>1,0,VLOOKUP(E20,'8'!$A$2:$B$1503,2,TRUE))))","v":""}]
{"$rows_left_out":382}
{"sheet":"7","index":7,"n_rows":40,"n_cols":3,"rows_kept":40,"cut":false,"hidden":false,"merged":[[0,2,0,14],[6,2,6,14],[1,2,1,14],[9,2,9,14],[7,2,7,14],[8,2,8,14],[10,2,10,14],[4,2,4,14],[3,2,3,14],[5,2,5,14],[2,2,2,14]]}
["Q","A","Decision Tree for Extrapolation (Romaine Lettuce)"]
[1,{"$f":"'5'!B11","v":"yes"},"Was the model validated for interpolation?"]
[2,"yes","Were data independent?"]
[3,"yes","Were data collected with the same methods as dependent data except for the new independent variable being evaluated?"]
[4,"yes","Were the independent variables at the same values as those used in model development?"]
[5,"yes","Was there a minimum of two prediction cases per combination of independent variables?"]
[6,"yes","Did all combinations of the independent variables have the same number of prediction cases?"]
[7,"yes","Was the overall pAPZ ≥ 0.70?"]
[8,"yes","Was pAPZ for all individual levels of independent variables ≥ 0.70?"]
[9,"yes","Was a single pAPZ ≥ 0.70 for every three consecutive combinations of the independent variables?"]
[10,{"$f":"IF(CONCATENATE(B2,B3,B4,B5,B6,B7,B8,B10)=\"yesyesyesyesyesyesyesyes\",\"yes\",\"no\")","v":"yes"},"Was the model validated for extrapolation?"]
["Average of APZ","Time"]
["Temp","(blank)","Total"]
["(blank)",{"$error":"#DIV/0!"},{"$error":"#DIV/0!"}]
["Total",{"$error":"#DIV/0!"},{"$error":"#DIV/0!"}]
[]
[]
[]
[]
[]
{"$rows_left_out":21}
{"sheet":"8","index":8,"n_rows":1503,"n_cols":2,"rows_kept":1503,"cut":false,"hidden":false,"merged":[]}
["Residual","APZ"]
[-1.9999999999998899,-8.81239525796218E-16]
[-1.99899999999989,9.9999999999911878E-4]
[-1.9979999999998901,1.9999999999991188E-3]
[-1.9969999999998902,2.9999999999991188E-3]
[-1.9959999999998903,3.9999999999991188E-3]
[-1.9949999999998904,4.9999999999991189E-3]
[-1.9939999999998905,5.9999999999991189E-3]
[-1.9929999999998906,6.9999999999991189E-3]
[-1.9919999999998907,7.9999999999991189E-3]
[-1.9909999999998909,8.9999999999991198E-3]
[-1.989999999999891,9.9999999999991207E-3]
[-1.9889999999998911,1.0999999999999122E-2]
[-1.9879999999998912,1.1999999999999122E-2]
[-1.9869999999998913,1.2999999999999123E-2]
[-1.9859999999998914,1.3999999999999124E-2]
[-1.9849999999998915,1.4999999999999125E-2]
[-1.9839999999998916,1.5999999999999126E-2]
[-1.9829999999998917,1.6999999999999127E-2]
[-1.9819999999998918,1.7999999999999128E-2]
{"$rows_left_out":1483}