{"text_format":"1","workbook":"xlsx","n_sheets":9,"sheets":["_xltb_storage_","1","2","3","4","5","6","7","8"],"not_rendered":{"charts":1,"images":0,"macros":1,"external_links":1,"defined_names":118,"comments":0,"pivot_tables":3},"unopened":[],"bounds":{"document_bytes":16777216,"sheet_cells":100000,"rows_first":2000,"rows_last":500,"rows_between":2000,"halvings":0,"cell_chars":16384,"cell_head_chars":4096},"cells_cut":0,"cells_raw":0,"read":"whole","date_system":"1900"}

{"sheet":"_xltb_storage_","index":0,"n_rows":2,"n_cols":3,"rows_kept":2,"cut":false,"hidden":true,"merged":[]}
["XL Toolbox Settings"]
[null,"export_path","C:\\Users\\Thomas Oscar\\Documents\\My Documents\\2020\\2020r\\2020X\\Figure 3.png"]

{"sheet":"1","index":1,"n_rows":140,"n_cols":37,"rows_kept":140,"cut":false,"hidden":false,"merged":[[3,1,3,4],[6,1,6,4],[0,4,2,4],[0,0,2,3],[5,1,5,4],[7,1,7,4],[8,1,8,4],[9,1,9,4],[10,0,15,4],[4,1,4,4]]}
["Validation Tool for Predictive Microbiology (Version LN)",null,null,null,"ValTLN"]
[]
[]
["Spreadsheet","Description"]
[2,"Dependent Data Input"]
[3,"Decision Tree for Dependent Data"]
[4,"Independent Data for Interpolation"]
[5,"Decision Tree for Interpolation"]
[6,"Independent Data for Extrapolation"]
[7,"Decision Tree for Extrapolation"]
["Welcome to ValT (vault) a spreadsheet tool for validation of primary, secondary, and tertiary models that predict log number of human bacterial pathogens in food as a function of one or more independent variables.  ValT was developed by the U. S. Department of Agriculture, Agricultural Research Service.  It is based on the test data, model performance, and model validation criteria of the acceptable prediction zones (APZ) method.     "]
[]
[]
[]
[]
[]
[]
[]
[]
[]
[]
[]
[]
[]
[]
[]
[]
[null,null,null,null,null,null,null,null,null,null,null,null,null,null,null,null,null,null,null,null,null,null,null,null,null,null,null,0.5,0.5,{"$f":"-2*AC28","v":-1},null,0.86,-0.53,null,0.5,1,{"$f":"-2*AJ28","v":-2}]
[null,null,null,null,null,null,null,null,null,null,null,null,null,null,null,null,null,null,null,null,null,null,null,null,null,null,null,0.60000000000000009,0.5,-1,null,0.95000000000000007,-0.53,null,0.60000000000000009,1,-2]
[null,null,null,null,null,null,null,null,null,null,null,null,null,null,null,null,null,null,null,null,null,null,null,null,null,null,null,0.70000000000000007,0.5,-1,null,0.55000000000000004,-0.53,null,0.70000000000000007,1,-2]
{"$rows_left_out":111}
{"sheet":"2","index":2,"n_rows":657,"n_cols":9,"rows_kept":657,"cut":false,"hidden":false,"merged":[]}
["Tag","Strain","Food","Temp","Time","Obs","Pred","Residual","APZ"]
["Train",18177,"milk",-20,0,7,6.99998477719656,{"$f":"IF(F2=\"\",\"\",IF(F2*G2<0,-2.01,F2-G2))","v":1.522280344001814E-5},{"$f":"IF(H2=\"\",\"\",IF(H2<-2,0,IF(H2>1,0,VLOOKUP(H2,'8'!$A$2:$B$1503,2,TRUE))))","v":1}]
["Train",18177,"milk",-20,1,6.6,6.599977166663809,2.2833336190686282E-5,{"$f":"IF(H3=\"\",\"\",IF(H3<-2,0,IF(H3>1,0,VLOOKUP(H3,'8'!$A$2:$B$1503,2,TRUE))))","v":1}]
["Train",18177,"milk",-20,2,5.6,5.6000038055560317,-3.8055560320771065E-6,{"$f":"IF(H4=\"\",\"\",IF(H4<-2,0,IF(H4>1,0,VLOOKUP(H4,'8'!$A$2:$B$1503,2,TRUE))))","v":1}]
["Train",18177,"milk",-20,3,4.7,4.7000342513077404,-3.425130774026286E-5,{"$f":"IF(H5=\"\",\"\",IF(H5<-2,0,IF(H5>1,0,VLOOKUP(H5,'8'!$A$2:$B$1503,2,TRUE))))","v":1}]
["Test",18177,"milk",-20,4,3.8,3.6499999999999861,0.15000000000001368,{"$f":"IF(H6=\"\",\"\",IF(H6<-2,0,IF(H6>1,0,VLOOKUP(H6,'8'!$A$2:$B$1503,2,TRUE))))","v":1}]
["Train",18177,"milk",-20,5,2.6,2.59994672018796,5.327981204006349E-5,{"$f":"IF(H7=\"\",\"\",IF(H7<-2,0,IF(H7>1,0,VLOOKUP(H7,'8'!$A$2:$B$1503,2,TRUE))))","v":1}]
["Train",18177,"milk",-20,6,1.2,1.2000228333361913,-2.2833336191352416E-5,{"$f":"IF(H8=\"\",\"\",IF(H8<-2,0,IF(H8>1,0,VLOOKUP(H8,'8'!$A$2:$B$1503,2,TRUE))))","v":1}]
["Train",18177,"milk",-20,7,0.4,0.4000148416685243,-1.484166852427915E-5,{"$f":"IF(H9=\"\",\"\",IF(H9<-2,0,IF(H9>1,0,VLOOKUP(H9,'8'!$A$2:$B$1503,2,TRUE))))","v":1}]
["Train",18177,"milk",-20,8,-0.01,-9.9843966264741013E-3,-1.5603373525898898E-5,{"$f":"IF(H10=\"\",\"\",IF(H10<-2,0,IF(H10>1,0,VLOOKUP(H10,'8'!$A$2:$B$1503,2,TRUE))))","v":1}]
["Test",18177,"milk",-20,9,-0.01,-9.9999999999891287E-3,-1.087151202394665E-14,{"$f":"IF(H11=\"\",\"\",IF(H11<-2,0,IF(H11>1,0,VLOOKUP(H11,'8'!$A$2:$B$1503,2,TRUE))))","v":1}]
["Train",18177,"milk",-20,10,-0.01,-9.9999999999997868E-3,-2.1337098754514727E-16,{"$f":"IF(H12=\"\",\"\",IF(H12<-2,0,IF(H12>1,0,VLOOKUP(H12,'8'!$A$2:$B$1503,2,TRUE))))","v":1}]
["Train",18177,"milk",-20,11,-0.01,-9.9999999999997868E-3,-2.1337098754514727E-16,{"$f":"IF(H13=\"\",\"\",IF(H13<-2,0,IF(H13>1,0,VLOOKUP(H13,'8'!$A$2:$B$1503,2,TRUE))))","v":1}]
["Train",18177,"milk",-20,12,-0.01,-9.9999999999997868E-3,-2.1337098754514727E-16,{"$f":"IF(H14=\"\",\"\",IF(H14<-2,0,IF(H14>1,0,VLOOKUP(H14,'8'!$A$2:$B$1503,2,TRUE))))","v":1}]
["Test",18177,"milk",-20,13,-0.01,-9.9999999999997868E-3,-2.1337098754514727E-16,{"$f":"IF(H15=\"\",\"\",IF(H15<-2,0,IF(H15>1,0,VLOOKUP(H15,'8'!$A$2:$B$1503,2,TRUE))))","v":1}]
["Train",18177,"milk",-20,14,-0.01,-9.9999999999997868E-3,-2.1337098754514727E-16,{"$f":"IF(H16=\"\",\"\",IF(H16<-2,0,IF(H16>1,0,VLOOKUP(H16,'8'!$A$2:$B$1503,2,TRUE))))","v":1}]
["Train",29428,"milk",-20,0,7.5,7.4999619429913995,3.8057008600489439E-5,{"$f":"IF(H17=\"\",\"\",IF(H17<-2,0,IF(H17>1,0,VLOOKUP(H17,'8'!$A$2:$B$1503,2,TRUE))))","v":1}]
["Train",29428,"milk",-20,1,6.5,6.4999695555517452,3.0444448254840495E-5,{"$f":"IF(H18=\"\",\"\",IF(H18<-2,0,IF(H18>1,0,VLOOKUP(H18,'8'!$A$2:$B$1503,2,TRUE))))","v":1}]
["Train",29428,"milk",-20,2,4.7,4.6999847777758728,1.5222224127420247E-5,{"$f":"IF(H19=\"\",\"\",IF(H19<-2,0,IF(H19>1,0,VLOOKUP(H19,'8'!$A$2:$B$1503,2,TRUE))))","v":1}]
["Train",29428,"milk",-20,3,2.5,2.5000837254189201,-8.372541892009977E-5,{"$f":"IF(H20=\"\",\"\",IF(H20<-2,0,IF(H20>1,0,VLOOKUP(H20,'8'!$A$2:$B$1503,2,TRUE))))","v":1}]
["Test",29428,"milk",-20,4,1.2,1.2450000000000609,-4.5000000000060991E-2,{"$f":"IF(H21=\"\",\"\",IF(H21<-2,0,IF(H21>1,0,VLOOKUP(H21,'8'!$A$2:$B$1503,2,TRUE))))","v":1}]
["Train",29428,"milk",-20,5,-0.01,-9.9999999999997868E-3,-2.1337098754514727E-16,{"$f":"IF(H22=\"\",\"\",IF(H22<-2,0,IF(H22>1,0,VLOOKUP(H22,'8'!$A$2:$B$1503,2,TRUE))))","v":1}]
["Train",29428,"milk",-20,6,-0.01,-9.9999999999997868E-3,-2.1337098754514727E-16,{"$f":"IF(H23=\"\",\"\",IF(H23<-2,0,IF(H23>1,0,VLOOKUP(H23,'8'!$A$2:$B$1503,2,TRUE))))","v":1}]
["Train",29428,"milk",-20,7,-0.01,-9.9999999999997868E-3,-2.1337098754514727E-16,{"$f":"IF(H24=\"\",\"\",IF(H24<-2,0,IF(H24>1,0,VLOOKUP(H24,'8'!$A$2:$B$1503,2,TRUE))))","v":1}]
["Train",29428,"milk",-20,8,-0.01,-9.9999999999997868E-3,-2.1337098754514727E-16,{"$f":"IF(H25=\"\",\"\",IF(H25<-2,0,IF(H25>1,0,VLOOKUP(H25,'8'!$A$2:$B$1503,2,TRUE))))","v":1}]
["Test",29428,"milk",-20,9,-0.01,-9.9999999999997868E-3,-2.1337098754514727E-16,{"$f":"IF(H26=\"\",\"\",IF(H26<-2,0,IF(H26>1,0,VLOOKUP(H26,'8'!$A$2:$B$1503,2,TRUE))))","v":1}]
["Train",29428,"milk",-20,10,-0.01,-9.9999999999997868E-3,-2.1337098754514727E-16,{"$f":"IF(H27=\"\",\"\",IF(H27<-2,0,IF(H27>1,0,VLOOKUP(H27,'8'!$A$2:$B$1503,2,TRUE))))","v":1}]
["Train",29428,"milk",-20,11,-0.01,-9.9999999999997868E-3,-2.1337098754514727E-16,{"$f":"IF(H28=\"\",\"\",IF(H28<-2,0,IF(H28>1,0,VLOOKUP(H28,'8'!$A$2:$B$1503,2,TRUE))))","v":1}]
["Train",29428,"milk",-20,12,-0.01,-9.9999999999997868E-3,-2.1337098754514727E-16,{"$f":"IF(H29=\"\",\"\",IF(H29<-2,0,IF(H29>1,0,VLOOKUP(H29,'8'!$A$2:$B$1503,2,TRUE))))","v":1}]
["Test",29428,"milk",-20,13,-0.01,-9.9999999999997868E-3,-2.1337098754514727E-16,{"$f":"IF(H30=\"\",\"\",IF(H30<-2,0,IF(H30>1,0,VLOOKUP(H30,'8'!$A$2:$B$1503,2,TRUE))))","v":1}]
{"$rows_left_out":628}
{"sheet":"3","index":3,"n_rows":18,"n_cols":24,"rows_kept":18,"cut":false,"hidden":false,"merged":[[8,2,8,14],[7,2,7,14],[0,2,0,14],[1,2,1,14],[2,2,2,14],[3,2,3,14],[6,2,6,14],[4,2,4,14],[5,2,5,14]]}
["Q","A","Decision Tree for Dependent Data",null,null,null,null,null,null,null,null,null,null,null,null,null,null,null,null,null,null,null,null,"yes"]
[1,"yes","Were the data used to develop the model?",null,null,null,null,null,null,null,null,null,null,null,null,null,null,null,null,null,null,null,null,"no"]
[2,"no","Were the independent variables evenly spaced?"]
[3,"no","Was there a minimum of four prediction cases per combination of independent variables?"]
[4,"yes","Did all combinations of independent variables have the same number of prediction cases?"]
[5,"yes","Was the overall pAPZ ≥ 0.70?"]
[6,"yes","Was pAPZ for all individual levels of independent variables ≥ 0.70?"]
[7,"yes","Was a single pAPZ ≥ 0.70 for every three consecutive combinations of the independent variables?"]
[8,{"$f":"IF(CONCATENATE(B2,B3,B4,B5,B6,B7,B8)=\"yesyesyesyesyesyesyes\",\"yes\",\"no\")","v":"no"},"Was the model validated for dependent data?"]
["pAPZ","Temp"]
["Other",-20,1,10,20,30,40,"Avg"]
["milk",1,1,1,0.84615384615384615,0.88461538461538458,0.78184615384615386,0.9245714285714286]
[18177,1,1,1,0.84615384615384615,0.92307692307692313,0.79446153846153844,0.93247619047619046]
[29428,1,1,1,0.84615384615384615,0.84615384615384615,0.76923076923076927,0.91666666666666663]
["beef",1,1,1,1,1,0.98969230769230765,0.99832500000000002]
[18177,1,1,1,1,1,1,1]
[29428,1,1,1,1,1,0.97938461538461552,0.99665000000000004]
["Avg",1,1,1,0.92307692307692313,0.94230769230769229,0.88576923076923086,0.9605487804878049]

{"sheet":"4","index":4,"n_rows":657,"n_cols":10,"rows_kept":657,"cut":false,"hidden":false,"merged":[]}
["Tag","Species","Strain","Food","Temp","Time","Obs","Pred","Residual","APZ"]
[null,null,null,null,null,null,null,null,{"$f":"IF(G2=\"\",\"\",IF(G2*H2<0,-2.01,G2-H2))","v":""},{"$f":"IF(I2=\"\",\"\",IF(I2<=-2,0,IF(I2>1,0,VLOOKUP(I2,'8'!$A$2:$B$1503,2,TRUE))))","v":""}]
[null,null,null,null,null,null,null,null,{"$f":"IF(G3=\"\",\"\",IF(G3*H3<0,-2.01,G3-H3))","v":""},{"$f":"IF(I3=\"\",\"\",IF(I3<=-2,0,IF(I3>1,0,VLOOKUP(I3,'8'!$A$2:$B$1503,2,TRUE))))","v":""}]
[null,null,null,null,null,null,null,null,"",{"$f":"IF(I4=\"\",\"\",IF(I4<=-2,0,IF(I4>1,0,VLOOKUP(I4,'8'!$A$2:$B$1503,2,TRUE))))","v":""}]
[null,null,null,null,null,null,null,null,"",{"$f":"IF(I5=\"\",\"\",IF(I5<=-2,0,IF(I5>1,0,VLOOKUP(I5,'8'!$A$2:$B$1503,2,TRUE))))","v":""}]
[null,null,null,null,null,null,null,null,"",{"$f":"IF(I6=\"\",\"\",IF(I6<=-2,0,IF(I6>1,0,VLOOKUP(I6,'8'!$A$2:$B$1503,2,TRUE))))","v":""}]
[null,null,null,null,null,null,null,null,"",{"$f":"IF(I7=\"\",\"\",IF(I7<=-2,0,IF(I7>1,0,VLOOKUP(I7,'8'!$A$2:$B$1503,2,TRUE))))","v":""}]
[null,null,null,null,null,null,null,null,"",{"$f":"IF(I8=\"\",\"\",IF(I8<=-2,0,IF(I8>1,0,VLOOKUP(I8,'8'!$A$2:$B$1503,2,TRUE))))","v":""}]
[null,null,null,null,null,null,null,null,"",{"$f":"IF(I9=\"\",\"\",IF(I9<=-2,0,IF(I9>1,0,VLOOKUP(I9,'8'!$A$2:$B$1503,2,TRUE))))","v":""}]
[null,null,null,null,null,null,null,null,"",{"$f":"IF(I10=\"\",\"\",IF(I10<=-2,0,IF(I10>1,0,VLOOKUP(I10,'8'!$A$2:$B$1503,2,TRUE))))","v":""}]
[null,null,null,null,null,null,null,null,"",{"$f":"IF(I11=\"\",\"\",IF(I11<=-2,0,IF(I11>1,0,VLOOKUP(I11,'8'!$A$2:$B$1503,2,TRUE))))","v":""}]
[null,null,null,null,null,null,null,null,"",{"$f":"IF(I12=\"\",\"\",IF(I12<=-2,0,IF(I12>1,0,VLOOKUP(I12,'8'!$A$2:$B$1503,2,TRUE))))","v":""}]
[null,null,null,null,null,null,null,null,"",{"$f":"IF(I13=\"\",\"\",IF(I13<=-2,0,IF(I13>1,0,VLOOKUP(I13,'8'!$A$2:$B$1503,2,TRUE))))","v":""}]
[null,null,null,null,null,null,null,null,"",{"$f":"IF(I14=\"\",\"\",IF(I14<=-2,0,IF(I14>1,0,VLOOKUP(I14,'8'!$A$2:$B$1503,2,TRUE))))","v":""}]
[null,null,null,null,null,null,null,null,"",{"$f":"IF(I15=\"\",\"\",IF(I15<=-2,0,IF(I15>1,0,VLOOKUP(I15,'8'!$A$2:$B$1503,2,TRUE))))","v":""}]
[null,null,null,null,null,null,null,null,"",{"$f":"IF(I16=\"\",\"\",IF(I16<=-2,0,IF(I16>1,0,VLOOKUP(I16,'8'!$A$2:$B$1503,2,TRUE))))","v":""}]
[null,null,null,null,null,null,null,null,"",{"$f":"IF(I17=\"\",\"\",IF(I17<=-2,0,IF(I17>1,0,VLOOKUP(I17,'8'!$A$2:$B$1503,2,TRUE))))","v":""}]
[null,null,null,null,null,null,null,null,"",{"$f":"IF(I18=\"\",\"\",IF(I18<=-2,0,IF(I18>1,0,VLOOKUP(I18,'8'!$A$2:$B$1503,2,TRUE))))","v":""}]
[null,null,null,null,null,null,null,null,"",{"$f":"IF(I19=\"\",\"\",IF(I19<=-2,0,IF(I19>1,0,VLOOKUP(I19,'8'!$A$2:$B$1503,2,TRUE))))","v":""}]
[null,null,null,null,null,null,null,null,"",{"$f":"IF(I20=\"\",\"\",IF(I20<=-2,0,IF(I20>1,0,VLOOKUP(I20,'8'!$A$2:$B$1503,2,TRUE))))","v":""}]
[null,null,null,null,null,null,null,null,"",{"$f":"IF(I21=\"\",\"\",IF(I21<=-2,0,IF(I21>1,0,VLOOKUP(I21,'8'!$A$2:$B$1503,2,TRUE))))","v":""}]
[null,null,null,null,null,null,null,null,"",{"$f":"IF(I22=\"\",\"\",IF(I22<=-2,0,IF(I22>1,0,VLOOKUP(I22,'8'!$A$2:$B$1503,2,TRUE))))","v":""}]
[null,null,null,null,null,null,null,null,"",{"$f":"IF(I23=\"\",\"\",IF(I23<=-2,0,IF(I23>1,0,VLOOKUP(I23,'8'!$A$2:$B$1503,2,TRUE))))","v":""}]
[null,null,null,null,null,null,null,null,"",{"$f":"IF(I24=\"\",\"\",IF(I24<=-2,0,IF(I24>1,0,VLOOKUP(I24,'8'!$A$2:$B$1503,2,TRUE))))","v":""}]
[null,null,null,null,null,null,null,null,"",{"$f":"IF(I25=\"\",\"\",IF(I25<=-2,0,IF(I25>1,0,VLOOKUP(I25,'8'!$A$2:$B$1503,2,TRUE))))","v":""}]
[null,null,null,null,null,null,null,null,"",{"$f":"IF(I26=\"\",\"\",IF(I26<=-2,0,IF(I26>1,0,VLOOKUP(I26,'8'!$A$2:$B$1503,2,TRUE))))","v":""}]
[null,null,null,null,null,null,null,null,"",{"$f":"IF(I27=\"\",\"\",IF(I27<=-2,0,IF(I27>1,0,VLOOKUP(I27,'8'!$A$2:$B$1503,2,TRUE))))","v":""}]
[null,null,null,null,null,null,null,null,"",{"$f":"IF(I28=\"\",\"\",IF(I28<=-2,0,IF(I28>1,0,VLOOKUP(I28,'8'!$A$2:$B$1503,2,TRUE))))","v":""}]
[null,null,null,null,null,null,null,null,"",{"$f":"IF(I29=\"\",\"\",IF(I29<=-2,0,IF(I29>1,0,VLOOKUP(I29,'8'!$A$2:$B$1503,2,TRUE))))","v":""}]
[null,null,null,null,null,null,null,null,"",{"$f":"IF(I30=\"\",\"\",IF(I30<=-2,0,IF(I30>1,0,VLOOKUP(I30,'8'!$A$2:$B$1503,2,TRUE))))","v":""}]
{"$rows_left_out":628}
{"sheet":"5","index":5,"n_rows":44,"n_cols":3,"rows_kept":44,"cut":false,"hidden":false,"merged":[[9,2,9,14],[10,2,10,14],[0,2,0,14],[2,2,2,14],[3,2,3,14],[1,2,1,14],[4,2,4,14],[5,2,5,14],[6,2,6,14],[7,2,7,14],[8,2,8,14]]}
["Q","A","Decision Tree for Interpolation"]
[1,{"$f":"'3'!B9","v":"no"},"Was the model validated for dependent data?"]
[2,"yes","Were the data independent?"]
[3,"yes","Were the data collected using the same methods as dependent data?"]
[4,"no","Were the independent variables at values intermediate to those used in model development?"]
[5,"yes","Was there a minimum of two prediction cases per combination of independent variables?"]
[6,"no","Did all combinations of independent variables have the same number of prediction cases?"]
[7,"yes","Was the overall pAPZ ≥ 0.70?"]
[8,"yes","Was pAPZ for all individual levels of independent variables ≥ 0.70?"]
[9,"yes","Was a single pAPZ ≥ 0.70 for every three consecutive combinations of the independent variables?"]
[10,{"$f":"IF(CONCATENATE(B2,B3,B4,B5,B6,B7,B8,B9,B10)=\"yesyesyesyesyesyesyesyesyes\",\"yes\",\"no\")","v":"no"},"Was the model validated for interpolation?"]
["Average of APZ","Time"]
["Temp","Average"]
["Average"]
[]
[]
[]
[]
[]
[]
[]
[]
[]
[]
[]
[]
[]
[]
[]
[]
{"$rows_left_out":15}
{"sheet":"6","index":6,"n_rows":657,"n_cols":9,"rows_kept":657,"cut":false,"hidden":false,"merged":[]}
["Tag","Strain","Food","Temp","Time","Obs","Pred","Residual","APZ"]
["Train",18177,"milk",-20,0,7,5.7,{"$f":"IF(F2=\"\",\"\",IF(F2*G2<0,-2.01,F2-G2))","v":1.2999999999999998},{"$f":"IF(H2=\"\",\"\",IF(H2<-2,0,IF(H2>1,0,VLOOKUP(H2,'8'!$A$2:$B$1503,2,TRUE))))","v":0}]
["Train",18177,"milk",-20,1,6.6,5.7,0.89999999999999947,{"$f":"IF(H3=\"\",\"\",IF(H3<-2,0,IF(H3>1,0,VLOOKUP(H3,'8'!$A$2:$B$1503,2,TRUE))))","v":0.20200000000000018}]
["Train",18177,"milk",-20,2,5.6,5.4,0.19999999999999929,{"$f":"IF(H4=\"\",\"\",IF(H4<-2,0,IF(H4>1,0,VLOOKUP(H4,'8'!$A$2:$B$1503,2,TRUE))))","v":1}]
["Train",18177,"milk",-20,3,4.7,5.4,-0.70000000000000018,{"$f":"IF(H5=\"\",\"\",IF(H5<-2,0,IF(H5>1,0,VLOOKUP(H5,'8'!$A$2:$B$1503,2,TRUE))))","v":1}]
["Test",18177,"milk",-20,4,3.8,5.4,-1.6000000000000005,{"$f":"IF(H6=\"\",\"\",IF(H6<-2,0,IF(H6>1,0,VLOOKUP(H6,'8'!$A$2:$B$1503,2,TRUE))))","v":0.39899999999999947}]
["Train",18177,"milk",-20,5,2.6,5.2,-2.6,{"$f":"IF(H7=\"\",\"\",IF(H7<-2,0,IF(H7>1,0,VLOOKUP(H7,'8'!$A$2:$B$1503,2,TRUE))))","v":0}]
["Train",18177,"milk",-20,6,1.2,5.2,-4,{"$f":"IF(H8=\"\",\"\",IF(H8<-2,0,IF(H8>1,0,VLOOKUP(H8,'8'!$A$2:$B$1503,2,TRUE))))","v":0}]
["Train",18177,"milk",-20,7,0.4,5.2,-4.8,{"$f":"IF(H9=\"\",\"\",IF(H9<-2,0,IF(H9>1,0,VLOOKUP(H9,'8'!$A$2:$B$1503,2,TRUE))))","v":0}]
["Train",18177,"milk",-20,8,-0.01,5.2,-2.0099999999999998,{"$f":"IF(H10=\"\",\"\",IF(H10<-2,0,IF(H10>1,0,VLOOKUP(H10,'8'!$A$2:$B$1503,2,TRUE))))","v":0}]
["Test",18177,"milk",-20,9,-0.01,4.75,-2.0099999999999998,{"$f":"IF(H11=\"\",\"\",IF(H11<-2,0,IF(H11>1,0,VLOOKUP(H11,'8'!$A$2:$B$1503,2,TRUE))))","v":0}]
["Train",18177,"milk",-20,10,-0.01,4.3,-2.0099999999999998,{"$f":"IF(H12=\"\",\"\",IF(H12<-2,0,IF(H12>1,0,VLOOKUP(H12,'8'!$A$2:$B$1503,2,TRUE))))","v":0}]
["Train",18177,"milk",-20,11,-0.01,4.3,-2.0099999999999998,{"$f":"IF(H13=\"\",\"\",IF(H13<-2,0,IF(H13>1,0,VLOOKUP(H13,'8'!$A$2:$B$1503,2,TRUE))))","v":0}]
["Train",18177,"milk",-20,12,-0.01,4.3,-2.0099999999999998,{"$f":"IF(H14=\"\",\"\",IF(H14<-2,0,IF(H14>1,0,VLOOKUP(H14,'8'!$A$2:$B$1503,2,TRUE))))","v":0}]
["Test",18177,"milk",-20,13,-0.01,4.3,-2.0099999999999998,{"$f":"IF(H15=\"\",\"\",IF(H15<-2,0,IF(H15>1,0,VLOOKUP(H15,'8'!$A$2:$B$1503,2,TRUE))))","v":0}]
["Train",18177,"milk",-20,14,-0.01,3.7,-2.0099999999999998,{"$f":"IF(H16=\"\",\"\",IF(H16<-2,0,IF(H16>1,0,VLOOKUP(H16,'8'!$A$2:$B$1503,2,TRUE))))","v":0}]
["Train",29428,"milk",-20,0,7.5,6.1,1.4000000000000004,{"$f":"IF(H17=\"\",\"\",IF(H17<-2,0,IF(H17>1,0,VLOOKUP(H17,'8'!$A$2:$B$1503,2,TRUE))))","v":0}]
["Train",29428,"milk",-20,1,6.5,6.1,0.40000000000000036,{"$f":"IF(H18=\"\",\"\",IF(H18<-2,0,IF(H18>1,0,VLOOKUP(H18,'8'!$A$2:$B$1503,2,TRUE))))","v":1}]
["Train",29428,"milk",-20,2,4.7,5.0999999999999996,-0.39999999999999947,{"$f":"IF(H19=\"\",\"\",IF(H19<-2,0,IF(H19>1,0,VLOOKUP(H19,'8'!$A$2:$B$1503,2,TRUE))))","v":1}]
["Train",29428,"milk",-20,3,2.5,5.0999999999999996,-2.5999999999999996,{"$f":"IF(H20=\"\",\"\",IF(H20<-2,0,IF(H20>1,0,VLOOKUP(H20,'8'!$A$2:$B$1503,2,TRUE))))","v":0}]
["Test",29428,"milk",-20,4,1.2,5.0999999999999996,-3.8999999999999995,{"$f":"IF(H21=\"\",\"\",IF(H21<-2,0,IF(H21>1,0,VLOOKUP(H21,'8'!$A$2:$B$1503,2,TRUE))))","v":0}]
["Train",29428,"milk",-20,5,-0.01,4.5,-2.0099999999999998,{"$f":"IF(H22=\"\",\"\",IF(H22<-2,0,IF(H22>1,0,VLOOKUP(H22,'8'!$A$2:$B$1503,2,TRUE))))","v":0}]
["Train",29428,"milk",-20,6,-0.01,4.5,-2.0099999999999998,{"$f":"IF(H23=\"\",\"\",IF(H23<-2,0,IF(H23>1,0,VLOOKUP(H23,'8'!$A$2:$B$1503,2,TRUE))))","v":0}]
["Train",29428,"milk",-20,7,-0.01,4.5,-2.0099999999999998,{"$f":"IF(H24=\"\",\"\",IF(H24<-2,0,IF(H24>1,0,VLOOKUP(H24,'8'!$A$2:$B$1503,2,TRUE))))","v":0}]
["Train",29428,"milk",-20,8,-0.01,4.5,-2.0099999999999998,{"$f":"IF(H25=\"\",\"\",IF(H25<-2,0,IF(H25>1,0,VLOOKUP(H25,'8'!$A$2:$B$1503,2,TRUE))))","v":0}]
["Test",29428,"milk",-20,9,-0.01,4.25,-2.0099999999999998,{"$f":"IF(H26=\"\",\"\",IF(H26<-2,0,IF(H26>1,0,VLOOKUP(H26,'8'!$A$2:$B$1503,2,TRUE))))","v":0}]
["Train",29428,"milk",-20,10,-0.01,4,-2.0099999999999998,{"$f":"IF(H27=\"\",\"\",IF(H27<-2,0,IF(H27>1,0,VLOOKUP(H27,'8'!$A$2:$B$1503,2,TRUE))))","v":0}]
["Train",29428,"milk",-20,11,-0.01,4,-2.0099999999999998,{"$f":"IF(H28=\"\",\"\",IF(H28<-2,0,IF(H28>1,0,VLOOKUP(H28,'8'!$A$2:$B$1503,2,TRUE))))","v":0}]
["Train",29428,"milk",-20,12,-0.01,4,-2.0099999999999998,{"$f":"IF(H29=\"\",\"\",IF(H29<-2,0,IF(H29>1,0,VLOOKUP(H29,'8'!$A$2:$B$1503,2,TRUE))))","v":0}]
["Test",29428,"milk",-20,13,-0.01,4,-2.0099999999999998,{"$f":"IF(H30=\"\",\"\",IF(H30<-2,0,IF(H30>1,0,VLOOKUP(H30,'8'!$A$2:$B$1503,2,TRUE))))","v":0}]
{"$rows_left_out":628}
{"sheet":"7","index":7,"n_rows":44,"n_cols":18,"rows_kept":44,"cut":false,"hidden":false,"merged":[[0,2,0,14],[6,2,6,14],[1,2,1,14],[9,2,9,14],[7,2,7,14],[8,2,8,14],[10,2,10,14],[4,2,4,14],[3,2,3,14],[5,2,5,14],[2,2,2,14]]}
["Q","A","Decision Tree for Extrapolation (Other Food)"]
[1,{"$f":"'5'!B11","v":"no"},"Was the model validated for interpolation?",null,null,null,null,null,null,null,null,null,null,null,null,null,null,"yes"]
[2,"yes","Were data independent?",null,null,null,null,null,null,null,null,null,null,null,null,null,null,"no"]
[3,"yes","Were data collected with the same methods as dependent data except for the new independent variable being evaluated?"]
[4,"yes","Were the independent variables at the same values as those used in model development?"]
[5,"no","Was there a minimum of two prediction cases per combination of independent variables?"]
[6,"yes","Did all combinations of the independent variables have the same number of prediction cases?"]
[7,"no","Was the overall pAPZ ≥ 0.70?"]
[8,"no","Was pAPZ for all individual levels of independent variables ≥ 0.70?"]
[9,"no","Was a single pAPZ ≥ 0.70 for every three consecutive combinations of the independent variables?"]
[10,{"$f":"IF(CONCATENATE(B2,B3,B4,B5,B6,B7,B8,B9,B10)=\"yesyesyesyesyesyesyesyesyes\",\"yes\",\"no\")","v":"no"},"Was the model validated for extrapolation?"]
["pAPZ","Temp"]
["Other",-20,1,10,20,30,40,"Avg"]
["milk",0.15336666666666668,0.95653333333333324,0.60016666666666674,0.21538461538461534,0.20753846153846148,8.4115384615384592E-2,0.38383928571428572]
[18177,0.1734,0.97993333333333332,0.62040000000000006,0.17292307692307687,0.18661538461538449,7.6923076923076927E-2,0.38428571428571429]
[29428,0.13333333333333333,0.93313333333333337,0.5799333333333333,0.25784615384615378,0.22846153846153844,9.1307692307692256E-2,0.38339285714285715]
["beef",0.18980000000000002,0.79686666666666661,0.52673333333333339,3.6153846153846189E-2,9.9000000000000032E-2,5.0000000000000044E-3,0.30574324324324331]
[18177,0.25980000000000009,0.7937333333333334,0.66666666666666663,0,4.4153846153846196E-2,0,0.32133783783783793]
[29428,0.11979999999999993,0.8,0.38680000000000009,7.2307692307692378E-2,0.15384615384615385,1.0000000000000009E-2,0.2901486486486487]
["Avg",0.16247499999999998,0.87670000000000003,0.56345000000000012,0.12576923076923074,0.15326923076923074,4.4557692307692291E-2,0.34726265822784813]
[]
[]
[]
[]
[]
[]
[]
[]
[]
[]
{"$rows_left_out":15}
{"sheet":"8","index":8,"n_rows":1503,"n_cols":2,"rows_kept":1503,"cut":false,"hidden":false,"merged":[]}
["Residual","APZ"]
[-1.9999999999998899,-8.81239525796218E-16]
[-1.99899999999989,9.9999999999911878E-4]
[-1.9979999999998901,1.9999999999991188E-3]
[-1.9969999999998902,2.9999999999991188E-3]
[-1.9959999999998903,3.9999999999991188E-3]
[-1.9949999999998904,4.9999999999991189E-3]
[-1.9939999999998905,5.9999999999991189E-3]
[-1.9929999999998906,6.9999999999991189E-3]
[-1.9919999999998907,7.9999999999991189E-3]
[-1.9909999999998909,8.9999999999991198E-3]
[-1.989999999999891,9.9999999999991207E-3]
[-1.9889999999998911,1.0999999999999122E-2]
[-1.9879999999998912,1.1999999999999122E-2]
[-1.9869999999998913,1.2999999999999123E-2]
[-1.9859999999998914,1.3999999999999124E-2]
[-1.9849999999998915,1.4999999999999125E-2]
[-1.9839999999998916,1.5999999999999126E-2]
[-1.9829999999998917,1.6999999999999127E-2]
[-1.9819999999998918,1.7999999999999128E-2]
[-1.980999999999892,1.8999999999999129E-2]
[-1.9799999999998921,1.999999999999913E-2]
[-1.9789999999998922,2.099999999999913E-2]
[-1.9779999999998923,2.1999999999999131E-2]
[-1.9769999999998924,2.2999999999999132E-2]
[-1.9759999999998925,2.3999999999999133E-2]
[-1.9749999999998926,2.4999999999999134E-2]
[-1.9739999999998927,2.5999999999999135E-2]
[-1.9729999999998928,2.6999999999999136E-2]
[-1.9719999999998929,2.7999999999999137E-2]
{"$rows_left_out":1473}